{"text_format":"1","workbook":"xlsx","n_sheets":4,"sheets":["記入例","印刷表示","入力","リスト"],"not_rendered":{"charts":0,"images":8,"macros":1,"external_links":0,"defined_names":2,"comments":0,"pivot_tables":0},"unopened":[],"bounds":{"document_bytes":16777216,"sheet_cells":100000,"rows_first":2000,"rows_last":500,"rows_between":2000,"halvings":0,"cell_chars":16384,"cell_head_chars":4096},"cells_cut":0,"cells_raw":0,"read":"whole","date_system":"1900"}

{"sheet":"記入例","index":0,"n_rows":25,"n_cols":7,"rows_kept":25,"cut":false,"hidden":false,"merged":[[24,3,24,6],[9,2,9,6],[12,2,12,6],[0,1,0,7],[20,3,20,6],[21,3,21,6],[22,2,23,2],[22,3,23,6],[5,2,5,6]]}
[null,"◎展示作品　「氏名カード」について\n\n　\n◎地区で使用した「氏名カード」は貼り替えない（県中文祭まで使用していく）\n　　　　　　　　　　　　⇒　どの地区の作品か分かりやすいため\n\n◎作品に関するコメントもできるだけ記入し、\n　　　　観賞する側に対して作品の思いが伝わるようにしていきたい。\n　　　　　（コメントは強制ではない）"]
[]
[null,null,"記入例"]
[]
[null,null,"※沖縄県中文連ホームページよりダウンロード（エクセル）"]
[null,null,"※ファイルは、様式のみと、連続印刷用と２種類あります。"]
[null,null,null,"○展示作品カードからダウンロード"]
[]
[null,null,"※入力シートに　学校名・地区中文連名を記入"]
[null,null,"　　学校名は　市町村立から明記して下さい\n　　　　　◯◯◯市立◯◯　中学校"]
[null,null,"※生徒氏名・学年・題名の入力"]
[null,null,"※作品に対するコメント　２行程度（コメントは強制ではない）"]
[null,null,"　　　　　印刷後、生徒に直接記入させてもよい"]
[null,null,"※用紙は　Ｂ５　用紙縦置きで印刷して下さい。"]
[null,null,"※県中文祭に出品するときは張り替えの必要は無いです。"]
[null,null,"　　どの地区の作品ということがわかりやすいため"]
[]
[]
[]
[null,null,"学校名","沖縄市立　○○〇","中学校",3,"年"]
[null,null,"氏　名","中文連　太　郞"]
[null,null,"題　名"]
[null,null,"コメント"]
[]
[null,null,null,"◯◯地区　中　学　校　文　化　連　盟"]

{"sheet":"印刷表示","index":1,"n_rows":27,"n_cols":7,"rows_kept":27,"cut":false,"hidden":false,"merged":[[2,5,11,8],[24,2,25,2],[24,3,25,6],[26,3,26,6],[21,3,21,4],[22,3,22,6],[23,3,23,6]]}
[]
["印刷表示\nNo.",null,1]
[null,null,null,null,null,"用紙サイズ\n\nＢ５"]
[]
[]
[]
[]
[]
[]
[]
[]
[]
[]
[]
[]
[]
[]
[]
[]
[]
[]
[null,null,"学校名",{"$f":"入力!$C$4","v":0},null,{"$f":"IF(VLOOKUP($C$2,入力!$A$8:$E$507,3)=\"\",\"\",+VLOOKUP($C$2,入力!$A$8:$E$507,3))","v":""},"年"]
[null,null,"氏　名",{"$f":"IF(VLOOKUP($C$2,入力!$A$8:$E$507,2)=\"\",\"\",+VLOOKUP($C$2,入力!$A$8:$E$507,2))","v":""}]
[null,null,"題　名",{"$f":"IF(VLOOKUP($C$2,入力!$A$8:$E$507,4)=\"\",\"\",+VLOOKUP($C$2,入力!$A$8:$E$507,4))","v":""}]
[null,null,"コメント",{"$f":"IF(VLOOKUP($C$2,入力!$A$8:$E$507,5)=\"\",\"\",+VLOOKUP($C$2,入力!$A$8:$E$507,5))","v":""}]
[]
[null,null,null,{"$f":"入力!$C$5","v":0}]

{"sheet":"入力","index":2,"n_rows":507,"n_cols":5,"rows_kept":507,"cut":false,"hidden":false,"merged":[[2,1,3,1],[2,2,2,3],[3,2,3,3],[4,2,4,3]]}
[]
[null,"基礎入力"]
[null,"学校名","記入例　【○○市町村立○○中学校】"]
[]
[null,"地区文化連盟\n選択⇒"]
[]
["No","生徒氏名","学年","題名","コ　メ　ン　ト（必要に応じて）"]
[1]
[2]
[3]
[4]
[5]
[6]
[7]
[8]
[9]
[10]
[11]
[12]
[13]
[14]
[15]
[16]
[17]
[18]
[19]
[20]
[21]
[22]
[23]
[24]
[25]
[26]
[27]
[28]
[29]
[30]
[31]
[32]
[33]
[34]
[35]
[36]
[37]
[38]
[39]
[40]
[41]
[42]
[43]
[44]
[45]
[46]
[47]
[48]
[49]
[50]
[51]
[52]
[53]
[54]
[55]
[56]
[57]
[58]
[59]
[60]
[61]
[62]
[63]
[64]
[65]
[66]
[67]
[68]
[69]
[70]
[71]
[72]
[73]
[74]
[75]
[76]
[77]
[78]
[79]
[80]
[81]
[82]
[83]
[84]
[85]
[86]
[87]
[88]
[89]
[90]
[91]
[92]
[93]
[94]
[95]
[96]
[97]
[98]
[99]
[100]
[101]
[102]
[103]
[104]
[105]
[106]
[107]
[108]
[109]
[110]
[111]
[112]
[113]
[114]
[115]
[116]
[117]
[118]
[119]
[120]
[121]
[122]
[123]
[124]
[125]
[126]
[127]
[128]
[129]
[130]
[131]
[132]
[133]
[134]
[135]
[136]
[137]
[138]
[139]
[140]
[141]
[142]
[143]
[144]
[145]
[146]
[147]
[148]
[149]
[150]
[151]
[152]
[153]
[154]
[155]
[156]
[157]
[158]
[159]
[160]
[161]
[162]
[163]
[164]
[165]
[166]
[167]
[168]
[169]
[170]
[171]
[172]
[173]
[174]
[175]
[176]
[177]
[178]
[179]
[180]
[181]
[182]
[183]
[184]
[185]
[186]
[187]
[188]
[189]
[190]
[191]
[192]
[193]
[194]
[195]
[196]
[197]
[198]
[199]
[200]
[201]
[202]
[203]
[204]
[205]
[206]
[207]
[208]
[209]
[210]
[211]
[212]
[213]
[214]
[215]
[216]
[217]
[218]
[219]
[220]
[221]
[222]
[223]
[224]
[225]
[226]
[227]
[228]
[229]
[230]
[231]
[232]
[233]
[234]
[235]
[236]
[237]
[238]
[239]
[240]
[241]
[242]
[243]
[244]
[245]
[246]
[247]
[248]
[249]
[250]
[251]
[252]
[253]
[254]
[255]
[256]
[257]
[258]
[259]
[260]
[261]
[262]
[263]
[264]
[265]
[266]
[267]
[268]
[269]
[270]
[271]
[272]
[273]
[274]
[275]
[276]
[277]
[278]
[279]
[280]
[281]
[282]
[283]
[284]
[285]
[286]
[287]
[288]
[289]
[290]
[291]
[292]
[293]
[294]
[295]
[296]
[297]
[298]
[299]
[300]
[301]
[302]
[303]
[304]
[305]
[306]
[307]
[308]
[309]
[310]
[311]
[312]
[313]
[314]
[315]
[316]
[317]
[318]
[319]
[320]
[321]
[322]
[323]
[324]
[325]
[326]
[327]
[328]
[329]
[330]
[331]
[332]
[333]
[334]
[335]
[336]
[337]
[338]
[339]
[340]
[341]
[342]
[343]
[344]
[345]
[346]
[347]
[348]
[349]
[350]
[351]
[352]
[353]
[354]
[355]
[356]
[357]
[358]
[359]
[360]
[361]
[362]
[363]
[364]
[365]
[366]
[367]
[368]
[369]
[370]
[371]
[372]
[373]
[374]
[375]
[376]
[377]
[378]
[379]
[380]
[381]
[382]
[383]
[384]
[385]
[386]
[387]
[388]
[389]
[390]
[391]
[392]
[393]
{"$rows_left_out":108}
{"sheet":"リスト","index":3,"n_rows":8,"n_cols":1,"rows_kept":8,"cut":false,"hidden":true,"merged":[]}
["沖縄県中学校文化連盟"]
["国 頭 地 区 中 学 校 文 化 連 盟"]
["中 頭 地 区 中 学 校 文 化 連 盟"]
["那 覇 地 区 中 学 校 文 化 連 盟"]
["島 尻 地 区 中 学 校 文 化 連 盟"]
["宮 古 地 区 中 学 校 文 化 連 盟"]
["八 重 山 地 区 中 学 校 文 化 連 盟"]
["沖縄県特別支援学校中学部文化連盟"]